Reaction Details
TargetDNA polymerase beta
LigandBDBM50250362
Substrate/Competitorn/a
Meas. Tech.ChEMBL_528872 (CHEMBL978545)
IC50 16000±n/a nM
Citation Sun, DAStarck, SRLocke, EPHecht, SM DNA polymerase beta inhibitors from Sandoricum koetjape. J Nat Prod62:1110-3 (1999) 
 
DNA polymerase beta
Name:DNA polymerase beta
Type:PROTEIN
Mol. Mass.:38334.34
Organism:Rattus norvegicus
Description:ChEMBL_1361926
Residue:335
BDBM50250362
NameBDBM50250362
Synonyms:3-Oximo-olean-12-en-29-oic acid | CHEMBL490347
TypeSmall organic molecule
Emp. Form.C30H47NO3
Mol. Mass.469.6991
SMILESCC1(C)C(CC[C@@]2(C)[C@H]1CC[C@]1(C)[C@@H]2CC=C2[C@@H]3C[C@@](C)(CC[C@]3(C)CC[C@@]12C)C(O)=O)N=O