Reaction Details
TargetDNA polymerase beta
LigandBDBM50259782
Substrate/Competitorn/a
Meas. Tech.ChEMBL_524724 (CHEMBL980279)
IC50 5600±n/a nM
Citation Deng, JZStarck, SRHecht, SM DNA polymerase beta inhibitors from Baeckea gunniana. J Nat Prod62:1624-6 (2000) DNA polymerase beta
Name:DNA polymerase beta
Type:PROTEIN
Mol. Mass.:38334.34
Organism:Rattus norvegicus
Description:ChEMBL_1361926
Residue:335
BDBM50259782
NameBDBM50259782
Synonyms:3beta-hydroxyrus-18,20(30)-dien-28-oic acid | CHEMBL479472
TypeSmall organic molecule
Emp. Form.C30H46O3
Mol. Mass.454.6844
SMILESCC1=C2[C@H]3CC[C@@H]4[C@@]5(C)CC[C@H](O)C(C)(C)[C@@H]5CC[C@@]4(C)[C@]3(C)CC[C@]2(CCC1=C)C(O)=O