Reaction Details
TargetDNA polymerase beta
LigandBDBM50259781
Substrate/Competitorn/a
Meas. Tech.ChEMBL_524725 (CHEMBL980280)
IC50 3200±n/a nM
Citation Deng, JZStarck, SRHecht, SM DNA polymerase beta inhibitors from Baeckea gunniana. J Nat Prod62:1624-6 (2000) DNA polymerase beta
Name:DNA polymerase beta
Type:PROTEIN
Mol. Mass.:38334.34
Organism:Rattus norvegicus
Description:ChEMBL_1361926
Residue:335
BDBM50259781
NameBDBM50259781
Synonyms:3beta-hydroxyrus-12,19(29)-dien-28-oic acid | CHEMBL517522
TypeSmall organic molecule
Emp. Form.C30H46O3
Mol. Mass.454.6844
SMILESC[C@@H]1CC[C@@]2(CC[C@]3(C)C(=CC[C@@H]4[C@@]5(C)CC[C@H](O)C(C)(C)[C@@H]5CC[C@@]34C)[C@@H]2C1=C)C(O)=O