Reaction Details
TargetDNA polymerase beta
LigandBDBM50241570
Substrate/Competitorn/a
Meas. Tech.ChEMBL_525607 (CHEMBL970018)
IC50 23000±n/a nM
Citation Deng, JZStarck, SRSun, DASabat, MHecht, SM A new 7,8-euphadien-type triterpenoid from Brackenridgea nitida and Bleasdalea bleasdalei that inhibits DNA polymerase beta. J Nat Prod63:1356-60 (2000) DNA polymerase beta
Name:DNA polymerase beta
Type:PROTEIN
Mol. Mass.:38334.34
Organism:Rattus norvegicus
Description:ChEMBL_1361926
Residue:335
BDBM50241570
NameBDBM50241570
Synonyms:(24E)-3beta-hydroxy-7,24-euphadien-26-oic acid | CHEMBL519411
TypeSmall organic molecule
Emp. Form.C31H50O3
Mol. Mass.470.7269
SMILESC[C@@H](CC\C=C(/C)C(O)=O)[C@]1(C)CC[C@]2(C)C3=CC[C@H]4C(C)(C)[C@@H](O)CC[C@]4(C)[C@H]3CC[C@@]12C