Reaction Details
TargetDNA topoisomerase 2-alpha
LigandBDBM50242374
Substrate/Competitorn/a
Meas. Tech.ChEMBL_509267 (CHEMBL996011)
IC50 4000±n/a nM
Citation Suzuki, KYahara, SMaehata, KUyeda, M Isoaurostatin, a novel topoisomerase inhibitor produced by Thermomonospora alba. J Nat Prod64:204-7 (2001) DNA topoisomerase 2-alpha
Name:DNA topoisomerase 2-alpha
Type:Protein
Mol. Mass.:174415.30
Organism:Homo sapiens (Human)
Description:P11388
Residue:1531
BDBM50242374
NameBDBM50242374
Synonyms:CHEMBL505529 | topostatin
TypeSmall organic molecule
Emp. Form.C36H58N4O11S
Mol. Mass.754.931
SMILESCCCCCCCC(C)CC=C(C)C=CC(=O)C(C)CCC1OC(=O)[C@H](CC(OS(O)(=O)=O)C(N)=O)NC(=O)[C@@H](C)CNC(=O)C(=C)NC(=O)C1C