Reaction Details
TargetType II restriction enzyme EcoRI
LigandBDBM50242374
Substrate/Competitorn/a
Meas. Tech.ChEMBL_509275 (CHEMBL996019)
IC50>250000±n/a nM
Citation Suzuki, KYahara, SMaehata, KUyeda, M Isoaurostatin, a novel topoisomerase inhibitor produced by Thermomonospora alba. J Nat Prod64:204-7 (2001) Type II restriction enzyme EcoRI
Name:Type II restriction enzyme EcoRI
Type:PROTEIN
Mol. Mass.:31063.04
Organism:Escherichia coli
Description:ChEMBL_504581
Residue:277
BDBM50242374
NameBDBM50242374
Synonyms:CHEMBL505529 | topostatin
TypeSmall organic molecule
Emp. Form.C36H58N4O11S
Mol. Mass.754.931
SMILESCCCCCCCC(C)CC=C(C)C=CC(=O)C(C)CCC1OC(=O)[C@H](CC(OS(O)(=O)=O)C(N)=O)NC(=O)[C@@H](C)CNC(=O)C(=C)NC(=O)C1C