Reaction Details
TargetType II restriction enzyme HindIII
LigandBDBM50242374
Substrate/Competitorn/a
Meas. Tech.ChEMBL_509276 (CHEMBL996020)
IC50 17000±n/a nM
Citation Suzuki, KYahara, SMaehata, KUyeda, M Isoaurostatin, a novel topoisomerase inhibitor produced by Thermomonospora alba. J Nat Prod64:204-7 (2001) Type II restriction enzyme HindIII
Name:Type II restriction enzyme HindIII
Type:PROTEIN
Mol. Mass.:34955.31
Organism:Haemophilus influenzae
Description:ChEMBL_509276
Residue:300
BDBM50242374
NameBDBM50242374
Synonyms:CHEMBL505529 | topostatin
TypeSmall organic molecule
Emp. Form.C36H58N4O11S
Mol. Mass.754.931
SMILESCCCCCCCC(C)CC=C(C)C=CC(=O)C(C)CCC1OC(=O)[C@H](CC(OS(O)(=O)=O)C(N)=O)NC(=O)[C@@H](C)CNC(=O)C(=C)NC(=O)C1C