Reaction Details
TargetTelomerase reverse transcriptase
LigandBDBM50242374
Substrate/Competitorn/a
Meas. Tech.ChEMBL_504718 (CHEMBL990278)
IC50>250000±n/a nM
Citation Suzuki, KYahara, SMaehata, KUyeda, M Isoaurostatin, a novel topoisomerase inhibitor produced by Thermomonospora alba. J Nat Prod64:204-7 (2001) Telomerase reverse transcriptase
Name:Telomerase reverse transcriptase
Type:PROTEIN
Mol. Mass.:127099.03
Organism:Homo sapiens (Human)
Description:ChEMBL_1447029
Residue:1132
BDBM50242374
NameBDBM50242374
Synonyms:CHEMBL505529 | topostatin
TypeSmall organic molecule
Emp. Form.C36H58N4O11S
Mol. Mass.754.931
SMILESCCCCCCCC(C)CC=C(C)C=CC(=O)C(C)CCC1OC(=O)[C@H](CC(OS(O)(=O)=O)C(N)=O)NC(=O)[C@@H](C)CNC(=O)C(=C)NC(=O)C1C