Reaction Details
TargetType II restriction enzyme EcoRI
LigandBDBM50008923
Substrate/Competitorn/a
Meas. Tech.ChEMBL_509275 (CHEMBL996019)
IC50>300000±n/a nM
Citation Suzuki, KYahara, SMaehata, KUyeda, M Isoaurostatin, a novel topoisomerase inhibitor produced by Thermomonospora alba. J Nat Prod64:204-7 (2001) Type II restriction enzyme EcoRI
Name:Type II restriction enzyme EcoRI
Type:PROTEIN
Mol. Mass.:31063.04
Organism:Escherichia coli
Description:ChEMBL_504581
Residue:277
BDBM50008923
NameBDBM50008923
Synonyms:(S)-4-ethyl-4-hydroxy-1,12-dihydro-4H-2-oxa-6,12a-diaza-dibenzo[b,h]florene-3,13-dione 4-Ethyl-4-hydroxy-1,12-dihydro-4H-2-oxa-6,12a-diaza-dibenzo[b,h]fluorene-3,13-dione 4-Ethyl-4-hydroxy-1,12-dihydro-4H-2-oxa-6,12a-diaza-dibenzo[b,h]fluorene-3,13-dione (Camptothecin) 4-ethyl-4-hydroxy-(4S)-3,4,12,14-tetrahydro-1H-pyrano[3',4':6,7]indolizino[1,2-b]quinoline-3,14-dione Camptothecin (CT) cid_24360
TypeSmall organic molecule
Emp. Form.C20H16N2O4
Mol. Mass.348.352
SMILESCC[C@@]1(O)C(=O)OCc2c1cc1-c3nc4ccccc4cc3Cn1c2=O