Reaction Details
TargetAromatase
LigandBDBM50251005
Substrate/Competitorn/a
Meas. Tech.ChEMBL_505994 (CHEMBL949646)
IC50 2200±n/a nM
Citation Lee, DBhat, KPFong, HHFarnsworth, NRPezzuto, JMKinghorn, AD Aromatase inhibitors from Broussonetia papyrifera. J Nat Prod64:1286-93 (2001) Aromatase
Name:Aromatase
Type:Enzyme
Mol. Mass.:57888.92
Organism:Homo sapiens (Human)
Description:P11511
Residue:503
BDBM50251005
NameBDBM50251005
Synonyms:(2S)-5,7,2',4'-tetrahydroxyflavanone CHEMBL458395
TypeSmall organic molecule
Emp. Form.C15H12O6
Mol. Mass.288.2522
SMILESOc1ccc([C@@H]2CC(=O)c3c(O)cc(O)cc3O2)c(O)c1