Reaction Details
TargetAromatase
LigandBDBM50251003
Substrate/Competitorn/a
Meas. Tech.ChEMBL_505994 (CHEMBL949646)
IC50 100±n/a nM
Citation Lee, DBhat, KPFong, HHFarnsworth, NRPezzuto, JMKinghorn, AD Aromatase inhibitors from Broussonetia papyrifera. J Nat Prod64:1286-93 (2001) Aromatase
Name:Aromatase
Type:Enzyme
Mol. Mass.:57888.92
Organism:Homo sapiens (Human)
Description:P11511
Residue:503
BDBM50251003
NameBDBM50251003
Synonyms:CHEMBL457679 isolicoflavonol
TypeSmall organic molecule
Emp. Form.C20H18O6
Mol. Mass.354.3533
SMILES[#6]\[#6](-[#6])=[#6]\[#6]-c1cc(ccc1-[#8])-c1oc2cc(-[#8])cc(-[#8])c2c(=O)c1-[#8]