Reaction Details
TargetChymotrypsin-like elastase family member 1
LigandBDBM50269564
Substrate/Competitorn/a
Meas. Tech.ChEMBL_480219 (CHEMBL1019939)
Ki 290±n/a nM
Citation Song, KSRaskin, I A prolyl endopeptidase-inhibiting benzofuran dimer from Polyozellus multiflex. J Nat Prod65:76-8 (2002) Chymotrypsin-like elastase family member 1
Name:Chymotrypsin-like elastase family member 1
Type:PROTEIN
Mol. Mass.:27805.35
Organism:Homo sapiens (Human)
Description:ChEMBL_63626
Residue:258
BDBM50269564
NameBDBM50269564
Synonyms:5,6,5',6'-tetrahydroxy[3,3']bibenzofuranyl-2,2'-dicarboxylic acid dimethyl ester | CHEMBL465606
TypeSmall organic molecule
Emp. Form.C20H14O10
Mol. Mass.414.3192
SMILESCOC(=O)c1oc2cc(O)c(O)cc2c1-c1c(oc2cc(O)c(O)cc12)C(=O)OC