Reaction Details
TargetProthrombin
LigandBDBM50269602
Substrate/Competitorn/a
Meas. Tech.ChEMBL_480323 (CHEMBL1021665)
IC50 7.4±n/a nM
Citation Murakami, YTakei, MShindo, KKitazume, CTanaka, JHiga, TFukamachi, H Cyclotheonamide E4 and E5, new potent tryptase inhibitors from an Ircinia species of sponge. J Nat Prod65:259-61 (2002) Prothrombin
Name:Prothrombin
Type:Protein
Mol. Mass.:70029.57
Organism:Homo sapiens (Human)
Description:P00734
Residue:622
BDBM50269602
NameBDBM50269602
Synonyms:CHEMBL448961 | cyclotheonamide E4
TypeSmall organic molecule
Emp. Form.C41H62N10O9
Mol. Mass.838.9926
SMILES[#6]-[#6]-[#6](-[#6])-[#6]-[#6](=O)-[#7]-[#6@@H](-[#6])-[#6](=O)-[#7]-[#6@H]-1-[#6]-[#7]-[#6](=O)\[#6]=[#6]\[#6@H](-[#6]-c2ccc(-[#8])cc2)-[#7]-[#6](=O)-[#6@@H](-[#7]-[#6](=O)-[#6](=O)-[#6@H](-[#6]-[#6]-[#6]\[#7]=[#6](\[#7])-[#7])-[#7]-[#6](=O)-[#6@@H]-2-[#6]-[#6]-[#6]-[#7]-2-[#6]-1=O)-[#6@H](-[#6])-[#6]-[#6]