Reaction Details
Target5-hydroxytryptamine receptor 2C
LigandBDBM50250840
Substrate/Competitorn/a
Meas. Tech.ChEMBL_486953 (CHEMBL1012215)
Ki 330±n/a nM
Citation Hu, JFSchetz, JAKelly, MPeng, JNAng, KKFlotow, HLeong, CYNg, SBBuss, ADWilkins, SPHamann, MT New antiinfective and human 5-HT2 receptor binding natural and semisynthetic compounds from the Jamaican sponge Smenospongia aurea. J Nat Prod65:476-80 (2002) 5-hydroxytryptamine receptor 2C
Name:5-hydroxytryptamine receptor 2C
Type:G Protein-Coupled Receptor (GPCR)
Mol. Mass.:51836.79
Organism:Homo sapiens (Human)
Description:P28335
Residue:458
BDBM50250840
NameBDBM50250840
Synonyms:5-(6-Bromo-1H-indol-3-ylmethylene)-2-imino-1,3-dimethyl-imidazolidin-4-one CHEMBL463249
TypeSmall organic molecule
Emp. Form.C14H13BrN4O
Mol. Mass.333.183
SMILESCN1C(=N)N(C)\C(=C\c2c[nH]c3cc(Br)ccc23)C1=O