Reaction Details
TargetPolyphenol oxidase 2
LigandBDBM26190
Substrate/Competitorn/a
Meas. Tech.ChEMBL_484471 (CHEMBL1010474)
IC50 4500000±n/a nM
Citation Li, CYWu, TS Constituents of the stigmas of Crocus sativus and their tyrosinase inhibitory activity. J Nat Prod65:1452-6 (2002) Polyphenol oxidase 2
Name:Polyphenol oxidase 2
Type:Protein
Mol. Mass.:63923.66
Organism:Agaricus bisporus (Common mushroom)
Description:O42713
Residue:556
BDBM26190
NameBDBM26190
Synonyms:1,4-Dihydroxybenzene, XIII CHEMBL537 Hydroquinone, HQ phenol derivative, 4
TypeSmall organic molecule
Emp. Form.C6H6O2
Mol. Mass.110.1106
SMILESOc1ccc(O)cc1