Reaction Details
TargetProstaglandin G/H synthase 1
LigandBDBM22360
Substrate/Competitorn/a
Meas. Tech.ChEMBL_484508 (CHEMBL1014034)
IC50 780000±n/a nM
Citation Huss, URingbom, TPerera, PBohlin, LVasänge, M Screening of ubiquitous plant constituents for COX-2 inhibition with a scintillation proximity based assay. J Nat Prod65:1517-21 (2002) Prostaglandin G/H synthase 1
Name:Prostaglandin G/H synthase 1
Type:Enzyme
Mol. Mass.:68692.62
Organism:Homo sapiens (Human)
Description:P23219
Residue:599
BDBM22360
NameBDBM22360
Synonyms:2-(acetyloxy)benzoate Acetylsalicylic acid Endosprin Zorprin cid_2244
TypeAnti-Inflammatory Agents, Non-Steroidal
Emp. Form.C9H8O4
Mol. Mass.180.1574
SMILESCC(=O)Oc1ccccc1C(O)=O