Reaction Details
TargetDNA topoisomerase 1
LigandBDBM50250904
Substrate/Competitorn/a
Meas. Tech.ChEMBL_509474 (CHEMBL1008110)
IC50>1000000±n/a nM
Citation Carballeira, NMBetancourt, JEOrellano, EAGonzález, FA Total synthesis and biological evaluation of (5Z,9Z)-5,9-hexadecadienoic acid, an inhibitor of human topoisomerase I. J Nat Prod65:1715-8 (2002) DNA topoisomerase 1
Name:DNA topoisomerase 1
Type:Enzyme
Mol. Mass.:90771.02
Organism:Homo sapiens (Human)
Description:P11387
Residue:765
BDBM50250904
NameBDBM50250904
Synonyms:CHEMBL460657 elaidic acid | trans-Delta(9)-octadecenoic acid
TypeSmall organic molecule
Emp. Form.C18H34O2
Mol. Mass.282.4614
SMILESCCCCCCCC\C=C\CCCCCCCC(O)=O