Reaction Details
TargetRyanodine receptor 1
LigandBDBM50241985
Substrate/Competitorn/a
Meas. Tech.ChEMBL_482230 (CHEMBL960265)
EC50>100000±n/a nM
Citation Masuno, MNMolinski, TF Cationic reduction of bastadin-4 to bastadin-5. Preparation of 5-[2h]-bastadin-5 by site-specific isotopic labeling. J Nat Prod66:112-4 (2003) 
 
Ryanodine receptor 1
Name:Ryanodine receptor 1
Type:PROTEIN
Mol. Mass.:565027.60
Organism:Homo sapiens (Human)
Description:ChEMBL_196055
Residue:5038
BDBM50241985
NameBDBM50241985
Synonyms:(E,Z)bastadin-19 CHEMBL506286 | CHEMBL508830
TypeSmall organic molecule
Emp. Form.C34H27Br5N4O8
Mol. Mass.1019.12
SMILESOc1c(Br)cc2CCNC(=O)C(Cc3cc(Br)c(O)c(Oc4c(Br)cc(CC(N=O)C(=O)NCCc5ccc(Oc1c2)c(Br)c5)cc4Br)c3)N=O