Reaction Details
TargetDNA polymerase beta
LigandBDBM50242090
Substrate/Competitorn/a
Meas. Tech.ChEMBL_550598 (CHEMBL999199)
IC50 18600±n/a nM
Citation Prakash Chaturvedula, VSHecht, SMGao, ZJones, SHFeng, XKingston, DG New neolignans that inhibit DNA polymerase beta lyase. J Nat Prod67:964-7 (2004) 
 
DNA polymerase beta
Name:DNA polymerase beta
Type:Protein
Mol. Mass.:38188.76
Organism:Homo sapiens (Human)
Description:n/a
Residue:335
BDBM50242090
NameBDBM50242090
Synonyms:2,4-Dimethoxy-5,6-methylenedioxy-1-(2-propenyl)benzene | CHEMBL469641
TypeSmall organic molecule
Emp. Form.C12H14O4
Mol. Mass.222.2372
SMILESCOc1cc(OC)c(CC=C)c2OCOc12