Reaction Details
TargetTyrosine-protein kinase Fyn
LigandBDBM50248765
Substrate/Competitorn/a
Meas. Tech.ChEMBL_542272 (CHEMBL1017821)
IC50 4000000±n/a nM
Citation Cohen, MSZhang, CShokat, KMTaunton, J Structural bioinformatics-based design of selective, irreversible kinase inhibitors. Science308:1318-21 (2005) 
 
Tyrosine-protein kinase Fyn
Name:Tyrosine-protein kinase Fyn
Type:Enzyme
Mol. Mass.:60762.21
Organism:Homo sapiens (Human)
Description:P06241
Residue:537
BDBM50248765
NameBDBM50248765
Synonyms:1-(4-amino-7-(3-hydroxypropyl)-5-p-tolyl-7H-pyrrolo[2,3-d]pyrimidin-6-yl)-2-fluoroethanone | CHEMBL515414
TypeSmall organic molecule
Emp. Form.C18H19FN4O2
Mol. Mass.342.3675
SMILESCc1ccc(cc1)-c1c(C(=O)CF)n(CCCO)c2ncnc(N)c12