Reaction Details
TargetDNA polymerase beta
LigandBDBM50241930
Substrate/Competitorn/a
Meas. Tech.ChEMBL_550664 (CHEMBL1002759)
IC50 342000±n/a nM
Citation Massiot, GLong, CDavid, BSerrano, MJDaubié, FAlby, FAusseil, FKnibiehler, MMoretti, CHoffmann, JSCazaux, CLavaud, C Acylphloroglucinol derivatives from Mahurea palustris. J Nat Prod68:979-84 (2005) 
 
DNA polymerase beta
Name:DNA polymerase beta
Type:Protein
Mol. Mass.:38188.76
Organism:Homo sapiens (Human)
Description:n/a
Residue:335
BDBM50241930
NameBDBM50241930
Synonyms:CHEMBL486194 | Mahureone E
TypeSmall organic molecule
Emp. Form.C32H48O6
Mol. Mass.528.7199
SMILES[#6]-[#6]-[#6]-[#6](-[#6]-[#6](-[#8])=O)-[#6]1=[#6]2-[#8]-[#6](=O)-[#6](-[#6](=O)-[#6](-[#6])-[#6]-[#6])-[#6](=O)C2([#6]\[#6]=[#6](\[#6])-[#6])[#6]-[#6](-[#6]\[#6]=[#6](\[#6])-[#6])C1([#6])[#6]