Reaction Details
TargetDNA polymerase beta
LigandBDBM50250426
Substrate/Competitorn/a
Meas. Tech.ChEMBL_547031 (CHEMBL1036029)
Ki 11000±n/a nM
Citation Deng, JZStarck, SRLi, SHecht, SM (+)-Myristinins A and D from Knema elegans, which inhibit DNA polymerase beta and cleave DNA. J Nat Prod68:1625-8 (2005) 
 
DNA polymerase beta
Name:DNA polymerase beta
Type:PROTEIN
Mol. Mass.:38334.34
Organism:Rattus norvegicus
Description:ChEMBL_1361926
Residue:335
BDBM50250426
NameBDBM50250426
Synonyms:(+)-Myristinin A | CHEMBL465365
TypeSmall organic molecule
Emp. Form.C33H40O7
Mol. Mass.548.6665
SMILESCCCCCCCCCCCC(=O)c1c(O)cc(O)c([C@@H]2C[C@H](Oc3cc(O)ccc23)c2ccc(O)cc2)c1O