Reaction Details
TargetProstaglandin G/H synthase 2
LigandBDBM50259771
Substrate/Competitorn/a
Meas. Tech.ChEMBL_528522 (CHEMBL972983)
IC50 370±n/a nM
Citation Homhual, SBunyapraphatsara, NKondratyuk, THerunsalee, AChaukul, WPezzuto, JMFong, HHZhang, HJ Bioactive dammarane triterpenes from the mangrove plant Bruguiera gymnorrhiza. J Nat Prod69:421-4 (2006) 
 
Prostaglandin G/H synthase 2
Name:Prostaglandin G/H synthase 2
Type:Enzyme
Mol. Mass.:69003.89
Organism:Homo sapiens (Human)
Description:Recombinant Cox-2 provided by Cayman (Cayman Chemical Co.,Ann Arbor, MI).
Residue:604
BDBM50259771
NameBDBM50259771
Synonyms:1beta,20-(S)-dihydroxydammar-24(25)-ene-3beta-O-stearate | CHEMBL504631
TypeSmall organic molecule
Emp. Form.C48H86O4
Mol. Mass.727.194
SMILES[#6]-[#6]-[#6]-[#6]-[#6]-[#6]-[#6]-[#6]-[#6]-[#6]-[#6]-[#6]-[#6]-[#6]-[#6]-[#6]-[#6]-[#6](=O)-[#8]-[#6@H]1-[#6]-[#6@@H](-[#8])[C@@]2([#6])[#6@@H](-[#6]-[#6][C@]3([#6])[#6@@H]2-[#6]-[#6]-[#6@@H]2-[#6@H](-[#6]-[#6][C@@]32[#6])[C@@]([#6])([#8])[#6]-[#6]\[#6]=[#6](\[#6])-[#6])C1([#6])[#6]