Reaction Details
TargetMu-type opioid receptor
LigandBDBM50170676
Substrate/Competitorn/a
Meas. Tech.ChEMBL_525304 (CHEMBL968093)
Ki 6820±n/a nM
Citation Tidgewell, KHarding, WWLozama, ACobb, HShah, KKannan, PDersch, CMParrish, DDeschamps, JRRothman, RBPrisinzano, TE Synthesis of salvinorin A analogues as opioid receptor probes. J Nat Prod69:914-8 (2006) 
 
Mu-type opioid receptor
Name:Mu-type opioid receptor
Type:G Protein-Coupled Receptor (GPCR)
Mol. Mass.:44789.51
Organism:Homo sapiens (Human)
Description:P35372
Residue:400
BDBM50170676
NameBDBM50170676
Synonyms:(2S,4aR,6aR,7R,9S,10aS,10bR)-methyl 2-(furan-3-yl)-6a,10b-dimethyl-9-(methylsulfonyloxy)-4,10-dioxo-dodecahydro-1H-benzo[f]isochromene-7-carboxylate CHEMBL365216
TypeSmall organic molecule
Emp. Form.C22H28O9S
Mol. Mass.468.517
SMILESCOC(=O)[C@@H]1C[C@H](OS(C)(=O)=O)C(=O)[C@H]2[C@@]1(C)CC[C@H]1C(=O)O[C@@H](C[C@]21C)c1ccoc1