Reaction Details
TargetMu-type opioid receptor
LigandBDBM50170672
Substrate/Competitorn/a
Meas. Tech.ChEMBL_525304 (CHEMBL968093)
Ki>1000±n/a nM
Citation Tidgewell, KHarding, WWLozama, ACobb, HShah, KKannan, PDersch, CMParrish, DDeschamps, JRRothman, RBPrisinzano, TE Synthesis of salvinorin A analogues as opioid receptor probes. J Nat Prod69:914-8 (2006) 
 
Mu-type opioid receptor
Name:Mu-type opioid receptor
Type:G Protein-Coupled Receptor (GPCR)
Mol. Mass.:44789.51
Organism:Homo sapiens (Human)
Description:P35372
Residue:400
BDBM50170672
NameBDBM50170672
Synonyms:(2S,4aR,6aR,7R,9S,10aS,10bR)-methyl 2-(furan-3-yl)-6a,10b-dimethyl-4,10-dioxo-9-(propionyloxy)-dodecahydro-1H-benzo[f]isochromene-7-carboxylate CHEMBL370272
TypeSmall organic molecule
Emp. Form.C24H30O8
Mol. Mass.446.4902
SMILESCCC(=O)O[C@H]1C[C@@H](C(=O)OC)[C@]2(C)CC[C@H]3C(=O)O[C@@H](C[C@]3(C)[C@H]2C1=O)c1ccoc1