Reaction Details
TargetKappa-type opioid receptor
LigandBDBM50269283
Substrate/Competitorn/a
Meas. Tech.ChEMBL_525306 (CHEMBL968095)
Ki 15±n/a nM
Citation Tidgewell, KHarding, WWLozama, ACobb, HShah, KKannan, PDersch, CMParrish, DDeschamps, JRRothman, RBPrisinzano, TE Synthesis of salvinorin A analogues as opioid receptor probes. J Nat Prod69:914-8 (2006) 
 
Kappa-type opioid receptor
Name:Kappa-type opioid receptor
Type:G Protein-Coupled Receptor (GPCR)
Mol. Mass.:42648.76
Organism:Homo sapiens (Human)
Description:P41145
Residue:380
BDBM50269283
NameBDBM50269283
Synonyms:(2S,4aS,6aR,7R,9S,10aS,10bR)-9-(Pentanoyloxy)-2-(3-furanyl)-dodecahydro-6a,10b-dimethyl-4,10-dioxo-2H-naphtho[2,1-c]pyran-7-carboxylic Acid Methyl Ester | CHEMBL498442
TypeSmall organic molecule
Emp. Form.C26H34O8
Mol. Mass.474.5434
SMILESCCCCC(=O)O[C@H]1C[C@@H](C(=O)OC)[C@]2(C)CC[C@H]3C(=O)O[C@@H](C[C@]3(C)[C@H]2C1=O)c1ccoc1