Reaction Details
TargetMu-type opioid receptor
LigandBDBM50269284
Substrate/Competitorn/a
Meas. Tech.ChEMBL_525304 (CHEMBL968093)
Ki 520±n/a nM
Citation Tidgewell, KHarding, WWLozama, ACobb, HShah, KKannan, PDersch, CMParrish, DDeschamps, JRRothman, RBPrisinzano, TE Synthesis of salvinorin A analogues as opioid receptor probes. J Nat Prod69:914-8 (2006) 
 
Mu-type opioid receptor
Name:Mu-type opioid receptor
Type:G Protein-Coupled Receptor (GPCR)
Mol. Mass.:44789.51
Organism:Homo sapiens (Human)
Description:P35372
Residue:400
BDBM50269284
NameBDBM50269284
Synonyms:(2S,4aS,6aR,7R,9S,10aS,10bR)-9-(Hexanoyloxy)-2-(3-furanyl)-dodecahydro-6a,10b-dimethyl-4,10-dioxo-2H-naphtho[2,1-c]pyran-7-carboxylic Acid Methyl Ester | CHEMBL498116
TypeSmall organic molecule
Emp. Form.C27H36O8
Mol. Mass.488.5699
SMILESCCCCCC(=O)O[C@H]1C[C@@H](C(=O)OC)[C@]2(C)CC[C@H]3C(=O)O[C@@H](C[C@]3(C)[C@H]2C1=O)c1ccoc1