Reaction Details
TargetSodium-dependent noradrenaline transporter
LigandBDBM35229
Substrate/Competitorn/a
Meas. Tech.ChEMBL_526495 (CHEMBL975646)
IC50 0.93±n/a nM
Citation Cheng, MCLi, CYKo, HCKo, FNLin, YLWu, TS Antidepressant principles of the roots of Polygala tenuifolia. J Nat Prod69:1305-9 (2006) 
 
Sodium-dependent noradrenaline transporter
Name:Sodium-dependent noradrenaline transporter
Type:Multi-pass membrane protein
Mol. Mass.:69337.72
Organism:Homo sapiens (Human)
Description:P23975
Residue:617
BDBM35229
NameBDBM35229
Synonyms:3-(10,11-dihydro-5H-dibenzo[b,f]azepin-5-yl)-N-methylpropan-1-amine CHEMBL72 DMI Desipramine N-(3-methylaminopropyl)iminobibenzyl demethylimipramine norimipramine
TypeSmall organic molecule
Emp. Form.C18H22N2
Mol. Mass.266.3807
SMILESCNCCCN1c2ccccc2CCc2ccccc12