Reaction Details
TargetCholinesterase
LigandBDBM50241737
Substrate/Competitorn/a
Meas. Tech.ChEMBL_526873 (CHEMBL979368)
IC50 10900±n/a nM
Citation Choudhary, MISiddiqui, ZANawaz, SAAtta-ur-Rahman, A Microbial transformation and butyrylcholinesterase inhibitory activity of (-)-caryophyllene oxide and its derivatives. J Nat Prod69:1429-34 (2006) 
 
Cholinesterase
Name:Cholinesterase
Type:Enzyme
Mol. Mass.:65643.35
Organism:Equus caballus (Horse)
Description:P81908
Residue:574
BDBM50241737
NameBDBM50241737
Synonyms:(1R,4R,5R,9S,11S)-4,5-epoxycaryophyllan-8(13)-en-14-ol | CHEMBL463194
TypeSmall organic molecule
Emp. Form.C15H24O2
Mol. Mass.236.3499
SMILESC[C@@]12CC[C@@H]3[C@H](C[C@]3(C)CO)C(=C)CC[C@H]1O2