Reaction Details
TargetBotulinum neurotoxin type A
LigandBDBM50260292
Substrate/Competitorn/a
Meas. Tech.ChEMBL_508387 (CHEMBL1008251)
Ki 30000±n/a nM
Citation Burnett, JCRuthel, GStegmann, CMPanchal, RGNguyen, TLHermone, ARStafford, RGLane, DJKenny, TAMcGrath, CFWipf, PStahl, AMSchmidt, JJGussio, RBrunger, ATBavari, S Inhibition of metalloprotease botulinum serotype A from a pseudo-peptide binding mode to a small molecule that is active in primary neurons. J Biol Chem282:5004-14 (2007) 
 
Botulinum neurotoxin type A
Name:Botulinum neurotoxin type A
Type:PROTEIN
Mol. Mass.:149421.96
Organism:Clostridium botulinum (strain Hall / ATCC 3502 / NCTC 13319 / Type A)
Description:ChEMBL_987932
Residue:1296
BDBM50260292
NameBDBM50260292
Synonyms:(2S,3R)-2-{(S)-2-[(S)-5-Guanidino-2-((S)-2-mercapto-3-phenyl-propionylamino)-pentanoylamino]-propionylamino}-3-hydroxy-butyric acid | CHEMBL538911
TypeSmall organic molecule
Emp. Form.C22H34N6O6S
Mol. Mass.510.607
SMILES[#6]-[#6@@H](-[#8])-[#6@H](-[#7]-[#6](=O)-[#6@H](-[#6])-[#7]-[#6](=O)-[#6@H](-[#6]-[#6]-[#6]\[#7]=[#6](/[#7])-[#7])-[#7]-[#6](=O)-[#6@@H](-[#16])-[#6]-c1ccccc1)-[#6](-[#8])=O