Reaction Details
TargetBotulinum neurotoxin type A
LigandBDBM50242311
Substrate/Competitorn/a
Meas. Tech.ChEMBL_508387 (CHEMBL1008251)
Ki 60000±n/a nM
Citation Burnett, JCRuthel, GStegmann, CMPanchal, RGNguyen, TLHermone, ARStafford, RGLane, DJKenny, TAMcGrath, CFWipf, PStahl, AMSchmidt, JJGussio, RBrunger, ATBavari, S Inhibition of metalloprotease botulinum serotype A from a pseudo-peptide binding mode to a small molecule that is active in primary neurons. J Biol Chem282:5004-14 (2007) 
 
Botulinum neurotoxin type A
Name:Botulinum neurotoxin type A
Type:PROTEIN
Mol. Mass.:149421.96
Organism:Clostridium botulinum (strain Hall / ATCC 3502 / NCTC 13319 / Type A)
Description:ChEMBL_987932
Residue:1296
BDBM50242311
NameBDBM50242311
Synonyms:(S)-5-Guanidino-2-((S)-2-mercapto-3-phenyl-propionylamino)-pentanoic acid | CHEMBL509348
TypeSmall organic molecule
Emp. Form.C15H22N4O3S
Mol. Mass.338.425
SMILES[#7]\[#6](-[#7])=[#7]/[#6]-[#6]-[#6]-[#6@H](-[#7]-[#6](=O)-[#6@@H](-[#16])-[#6]-c1ccccc1)-[#6](-[#8])=O