Reaction Details
TargetBotulinum neurotoxin type A
LigandBDBM50260300
Substrate/Competitorn/a
Meas. Tech.ChEMBL_508387 (CHEMBL1008251)
Ki 10000±n/a nM
Citation Burnett, JCRuthel, GStegmann, CMPanchal, RGNguyen, TLHermone, ARStafford, RGLane, DJKenny, TAMcGrath, CFWipf, PStahl, AMSchmidt, JJGussio, RBrunger, ATBavari, S Inhibition of metalloprotease botulinum serotype A from a pseudo-peptide binding mode to a small molecule that is active in primary neurons. J Biol Chem282:5004-14 (2007) 
 
Botulinum neurotoxin type A
Name:Botulinum neurotoxin type A
Type:PROTEIN
Mol. Mass.:149421.96
Organism:Clostridium botulinum (strain Hall / ATCC 3502 / NCTC 13319 / Type A)
Description:ChEMBL_987932
Residue:1296
BDBM50260300
NameBDBM50260300
Synonyms:6-(4,5-dihydro-1H-imidazol-2-yl)-2-(2-(2-(4,5-dihydro-1H-imidazol-2-yl)-1H-indol-6-yl)vinyl)-1H-indole NSC-341907
TypeSmall organic molecule
Emp. Form.C24H22N6
Mol. Mass.394.4717
SMILESC1CN=C(N1)c1cc2ccc(\C=C\c3cc4ccc(cc4[nH]3)C3=NCCN3)cc2[nH]1