Reaction Details
TargetIntegrin alpha-V
LigandBDBM50260254
Substrate/Competitorn/a
Meas. Tech.ChEMBL_504851 (CHEMBL983998)
IC50 1540±n/a nM
Citation DiCara, DRapisarda, CSutcliffe, JLViolette, SMWeinreb, PHHart, IRHoward, MJMarshall, JF Structure-function analysis of Arg-Gly-Asp helix motifs in alpha v beta 6 integrin ligands. J Biol Chem282:9657-65 (2007) 
 
Integrin alpha-V
Name:Integrin alpha-V
Type:PROTEIN
Mol. Mass.:116024.92
Organism:Homo sapiens (Human)
Description:ChEMBL_582336
Residue:1048
BDBM50260254
NameBDBM50260254
Synonyms:CHEMBL446897 | NAVPNLRGDLQVLAQKVART
TypeSmall organic molecule
Emp. Form.C93H163N31O28
Mol. Mass.2163.4802
SMILES[#6]-[#6](-[#6])-[#6]-[#6@H](-[#7]-[#6](=O)-[#6@@H](-[#7]-[#6](=O)-[#6@H](-[#6]-[#6]-[#6](-[#7])=O)-[#7]-[#6](=O)-[#6@H](-[#6]-[#6](-[#6])-[#6])-[#7]-[#6](=O)-[#6@H](-[#6]-[#6](-[#8])=O)-[#7]-[#6](=O)-[#6]-[#7]-[#6](=O)-[#6@H](-[#6]-[#6]-[#6]\[#7]=[#6](/[#7])-[#7])-[#7]-[#6](=O)-[#6@H](-[#6]-[#6](-[#6])-[#6])-[#7]-[#6](=O)-[#6@H](-[#6]-[#6](-[#7])=O)-[#7]-[#6](=O)-[#6@@H]-1-[#6]-[#6]-[#6]-[#7]-1-[#6](=O)-[#6@@H](-[#7]-[#6](=O)-[#6@H](-[#6])-[#7]-[#6](=O)-[#6@@H](-[#7])-[#6]-[#6](-[#7])=O)-[#6](-[#6])-[#6])-[#6](-[#6])-[#6])-[#6](=O)-[#7]-[#6@@H](-[#6])-[#6](=O)-[#7]-[#6@@H](-[#6]-[#6]-[#6](-[#7])=O)-[#6](=O)-[#7]-[#6@@H](-[#6]-[#6]-[#6]-[#6]-[#7])-[#6](=O)-[#7]-[#6@@H](-[#6](-[#6])-[#6])-[#6](=O)-[#7]-[#6@@H](-[#6])-[#6](=O)-[#7]-[#6@@H](-[#6]-[#6]-[#6]\[#7]=[#6](/[#7])-[#7])-[#6](=O)-[#7]-[#6@@H](-[#6@@H](-[#6])-[#8])-[#6](-[#8])=O