Reaction Details
TargetMast/stem cell growth factor receptor Kit
LigandBDBM13216
Substrate/Competitorn/a
Meas. Tech.ChEMBL_508798 (CHEMBL997066)
IC50 13±n/a nM
Citation Chu, JJYang, PL c-Src protein kinase inhibitors block assembly and maturation of dengue virus. Proc Natl Acad Sci U S A104:3520-5 (2007) 
 
Mast/stem cell growth factor receptor Kit
Name:Mast/stem cell growth factor receptor Kit
Type:Protein
Mol. Mass.:109869.37
Organism:Homo sapiens (Human)
Description:P10721
Residue:976
BDBM13216
NameBDBM13216
Synonyms:BMS-354825 DASATINIB N-(2-chloro-6-methylphenyl)-2-({6-[4-(2-hydroxyethyl)piperazin-1-yl]-2-methylpyrimidin-4-yl}amino)-1,3-thiazole-5-carboxamide US20230348453, Compound A8 med.21724, Compound Dasatinib
TypeSmall organic molecule
Emp. Form.C22H26ClN7O2S
Mol. Mass.488.006
SMILESCc1nc(Nc2ncc(s2)C(=O)Nc2c(C)cccc2Cl)cc(n1)N1CCN(CCO)CC1