Reaction Details
TargetRhodopsin kinase GRK1
LigandBDBM50049820
Substrate/Competitorn/a
Meas. Tech.ChEMBL_505103 (CHEMBL946634)
Ki 180±n/a nM
Citation Lee, SAJung, M The nucleoside analog sangivamycin induces apoptotic cell death in breast carcinoma MCF7/adriamycin-resistant cells via protein kinase Cdelta and JNK activation. J Biol Chem282:15271-83 (2007) 
 
Rhodopsin kinase GRK1
Name:Rhodopsin kinase GRK1
Type:PROTEIN
Mol. Mass.:63520.09
Organism:Homo sapiens (Human)
Description:ChEMBL_774378
Residue:563
BDBM50049820
NameBDBM50049820
Synonyms:4-Amino-5-carboxamide-7-(D-ribofuranosyl)pyrrolo[2,3-d]pyrimidine 4-Amino-7-(3,4-dihydroxy-5-hydroxymethyl-tetrahydro-furan-2-yl)-7H-pyrrolo[2,3-d]pyrimidine-5-carboxylic acid amide CHEMBL101892 cid_5153
TypeSmall organic molecule
Emp. Form.C12H15N5O5
Mol. Mass.309.278
SMILESNC(=O)c1cn([C@@H]2O[C@H](CO)[C@@H](O)[C@H]2O)c2ncnc(N)c12