Reaction Details
TargetFocal adhesion kinase 1
LigandBDBM50269948
Substrate/Competitorn/a
Meas. Tech.ChEMBL_505170 (CHEMBL950804)
IC50 100±n/a nM
Citation Slack-Davis, JKMartin, KHTilghman, RWIwanicki, MUng, EJAutry, CLuzzio, MJCooper, BKath, JCRoberts, WGParsons, JT Cellular characterization of a novel focal adhesion kinase inhibitor. J Biol Chem282:14845-52 (2007) 
 
Focal adhesion kinase 1
Name:Focal adhesion kinase 1
Type:Tyrosine-protein kinase
Mol. Mass.:119233.17
Organism:Homo sapiens (Human)
Description:Q05397
Residue:1052
BDBM50269948
NameBDBM50269948
Synonyms:6-(4-(3-(methylsulfonyl)benzylamino)-5-(trifluoromethyl)pyrimidin-2-ylamino)-3,4-dihydroquinolin-2(1H)-one D3RKN_2 US10266549, Example 32 | US10774092, Example 32
TypeSmall organic molecule
Emp. Form.C22H20F3N5O3S
Mol. Mass.491.486
SMILESCS(=O)(=O)c1cccc(CNc2nc(Nc3ccc4NC(=O)CCc4c3)ncc2C(F)(F)F)c1