Reaction Details
TargetParathyroid hormone/parathyroid hormone-related peptide receptor
LigandBDBM50269978
Substrate/Competitorn/a
Meas. Tech.ChEMBL_505703 (CHEMBL944465)
IC50 13.5±n/a nM
Citation Carter, PHLiu, RQFoster, WRTamasi, JATebben, AJFavata, MStaal, ACvijic, MEFrench, MHDell, VApanovitch, DLei, MZhao, QCunningham, MDecicco, CPTrzaskos, JMFeyen, JH Discovery of a small molecule antagonist of the parathyroid hormone receptor by using an N-terminal parathyroid hormone peptide probe. Proc Natl Acad Sci U S A104:6846-51 (2007) 
 
Parathyroid hormone/parathyroid hormone-related peptide receptor
Name:Parathyroid hormone/parathyroid hormone-related peptide receptor
Type:Enzyme Catalytic Domain
Mol. Mass.:66370.95
Organism:Homo sapiens (Human)
Description:PARATHYROID HT1 0 HUMAN::Q03431
Residue:593
BDBM50269978
NameBDBM50269978
Synonyms:Aib-Val-Aib-Glu-lle-Gln-Leu-Nle-His-Gln-Arg-Ala-Fly-Tyr | CHEMBL526677
TypeSmall organic molecule
Emp. Form.C96H137N23O23
Mol. Mass.1981.2553
SMILESCCCC[C@H](NC(=O)[C@H](CC(C)C)NC(=O)[C@H](CCC(N)=O)NC(=O)[C@@H](NC(=O)[C@H](CCC(O)=O)NC(=O)C(C)(C)NC(=O)[C@@H](NC(=O)C(C)(C)N)C(C)C)[C@@H](C)CC)C(=O)N[C@@H](Cc1cnc[nH]1)C(=O)N[C@@H](CCC(N)=O)C(=O)N[C@@H](CCCN=C(N)N)C(=O)N[C@@H](C)C(=O)N[C@@H](CCCCNC(=O)c1ccccc1-c1c2ccc(O)cc2oc2cc(=O)ccc12)C(=O)N[C@@H](Cc1ccc(O)cc1)C(N)=O