Reaction Details
TargetEstrogen receptor beta
LigandBDBM50154135
Substrate/Competitorn/a
Meas. Tech.ChEMBL_530438 (CHEMBL973102)
IC50 3±n/a nM
Citation Luan, FLiu, HTMa, WPFan, BT Classification of estrogen receptor-beta ligands on the basis of their binding affinities using support vector machine and linear discriminant analysis. Eur J Med Chem43:43-52 (2008) 
 
Estrogen receptor beta
Name:Estrogen receptor beta
Type:Protein
Mol. Mass.:59238.43
Organism:Homo sapiens (Human)
Description:Q92731
Residue:530
BDBM50154135
NameBDBM50154135
Synonyms:2-(6-Hydroxy-naphthalen-1-yl)-benzooxazol-6-ol CHEMBL189077
TypeSmall organic molecule
Emp. Form.C17H11NO3
Mol. Mass.277.2741
SMILESOc1ccc2nc(oc2c1)-c1cccc2cc(O)ccc12