Reaction Details
TargetThymidylate synthase
LigandBDBM50251171
Substrate/Competitorn/a
Meas. Tech.ChEMBL_530824 (CHEMBL969379)
Ki 6000±n/a nM
Citation Corona, PLoriga, MCosti, MPFerrari, SPaglietti, G Synthesis of N-(5,7-diamino-3-phenyl-quinoxalin-2-yl)-3,4,5-substituted anilines and N-[4[(5,7-diamino-3-phenylquinoxalin-2-yl)amino]benzoyl]-l-glutamic acid diethyl ester: evaluation of in vitro anti-cancer and anti-folate activities. Eur J Med Chem43:189-203 (2008) 
 
Thymidylate synthase
Name:Thymidylate synthase
Type:Enzyme
Mol. Mass.:36576.54
Organism:Lactobacillus casei
Description:n/a
Residue:316
BDBM50251171
NameBDBM50251171
Synonyms:2-[(3,5-Dimethoxy-phenyl)amino]-3-phenyl-5,7-dinitro-quinoxaline | CHEMBL518076
TypeSmall organic molecule
Emp. Form.C22H17N5O6
Mol. Mass.447.4003
SMILESCOc1cc(Nc2nc3cc(cc([N+]([O-])=O)c3nc2-c2ccccc2)[N+]([O-])=O)cc(OC)c1