Reaction Details
TargetThymidylate synthase
LigandBDBM50251163
Substrate/Competitorn/a
Meas. Tech.ChEMBL_530824 (CHEMBL969379)
Ki 1000±n/a nM
Citation Corona, PLoriga, MCosti, MPFerrari, SPaglietti, G Synthesis of N-(5,7-diamino-3-phenyl-quinoxalin-2-yl)-3,4,5-substituted anilines and N-[4[(5,7-diamino-3-phenylquinoxalin-2-yl)amino]benzoyl]-l-glutamic acid diethyl ester: evaluation of in vitro anti-cancer and anti-folate activities. Eur J Med Chem43:189-203 (2008) 
 
Thymidylate synthase
Name:Thymidylate synthase
Type:Enzyme
Mol. Mass.:36576.54
Organism:Lactobacillus casei
Description:n/a
Residue:316
BDBM50251163
NameBDBM50251163
Synonyms:2-[(3,4-Dichloro-phenyl)amino]-3-phenyl-5,7-diaminoquinoxaline | CHEMBL465890
TypeSmall organic molecule
Emp. Form.C20H15Cl2N5
Mol. Mass.396.273
SMILESNc1cc(N)c2nc(c(Nc3ccc(Cl)c(Cl)c3)nc2c1)-c1ccccc1