Reaction Details
TargetCannabinoid receptor 1
LigandBDBM50008022
Substrate/Competitorn/a
Meas. Tech.ChEMBL_531312 (CHEMBL989724)
IC50 0.32±n/a nM
Citation Moloney, GPAngus, JARobertson, ADStoermer, MJRobinson, MWright, CEMcRae, KChristopoulos, A Synthesis and cannabinoid activity of 1-substituted-indole-3-oxadiazole derivatives: novel agonists for the CB1 receptor. Eur J Med Chem43:513-39 (2008) 
 
Cannabinoid receptor 1
Name:Cannabinoid receptor 1
Type:G Protein-Coupled Receptor (GPCR)
Mol. Mass.:52868.96
Organism:Homo sapiens (Human)
Description:P21554
Residue:472
BDBM50008022
NameBDBM50008022
Synonyms:(4-Methoxy-phenyl)-(3-morpholin-4-ylmethyl-2,3-dihydro-1H-3a-aza-cyclopenta[a]inden-8-yl)-methanone CHEMBL28045
TypeSmall organic molecule
Emp. Form.C24H26N2O3
Mol. Mass.390.4748
SMILESCOc1ccc(cc1)C(=O)c1c2CCC(CN3CCOCC3)n2c2ccccc12