Reaction Details
TargetCannabinoid receptor 2
LigandBDBM50251193
Substrate/Competitorn/a
Meas. Tech.ChEMBL_531310 (CHEMBL989722)
IC50 1100±n/a nM
Citation Moloney, GPAngus, JARobertson, ADStoermer, MJRobinson, MWright, CEMcRae, KChristopoulos, A Synthesis and cannabinoid activity of 1-substituted-indole-3-oxadiazole derivatives: novel agonists for the CB1 receptor. Eur J Med Chem43:513-39 (2008) 
 
Cannabinoid receptor 2
Name:Cannabinoid receptor 2
Type:Enzyme
Mol. Mass.:39366.68
Organism:Rattus norvegicus (Rat)
Description:Q9QZN9
Residue:360
BDBM50251193
NameBDBM50251193
Synonyms:3-[3-Benzyl-[1,2,4]oxadiazol-5-yl]-1-(2-morpholin-4-yl-ethyl)-1H-indole | CHEMBL517157
TypeSmall organic molecule
Emp. Form.C23H24N4O2
Mol. Mass.388.4623
SMILESC(Cn1cc(-c2nc(Cc3ccccc3)no2)c2ccccc12)N1CCOCC1