Reaction Details
TargetCannabinoid receptor 1
LigandBDBM50260502
Substrate/Competitorn/a
Meas. Tech.ChEMBL_531309 (CHEMBL989721)
IC50 6100±n/a nM
Citation Moloney, GPAngus, JARobertson, ADStoermer, MJRobinson, MWright, CEMcRae, KChristopoulos, A Synthesis and cannabinoid activity of 1-substituted-indole-3-oxadiazole derivatives: novel agonists for the CB1 receptor. Eur J Med Chem43:513-39 (2008) 
 
Cannabinoid receptor 1
Name:Cannabinoid receptor 1
Type:G Protein-Coupled Receptor (GPCR)
Mol. Mass.:52856.55
Organism:Rattus norvegicus (rat)
Description:P20272
Residue:473
BDBM50260502
NameBDBM50260502
Synonyms:4-((3-(3-Benzyl-1,2,4-oxadiazol-5-yl)-1H-indol-1-yl)-methyl)oxazolidine-2-one | CHEMBL495416
TypeSmall organic molecule
Emp. Form.C21H18N4O3
Mol. Mass.374.3926
SMILESO=C1NC(Cn2cc(-c3nc(Cc4ccccc4)no3)c3ccccc23)CO1