Reaction Details
TargetCannabinoid receptor 1
LigandBDBM50260495
Substrate/Competitorn/a
Meas. Tech.ChEMBL_531309 (CHEMBL989721)
IC50 6200±n/a nM
Citation Moloney, GPAngus, JARobertson, ADStoermer, MJRobinson, MWright, CEMcRae, KChristopoulos, A Synthesis and cannabinoid activity of 1-substituted-indole-3-oxadiazole derivatives: novel agonists for the CB1 receptor. Eur J Med Chem43:513-39 (2008) 
 
Cannabinoid receptor 1
Name:Cannabinoid receptor 1
Type:G Protein-Coupled Receptor (GPCR)
Mol. Mass.:52856.55
Organism:Rattus norvegicus (rat)
Description:P20272
Residue:473
BDBM50260495
NameBDBM50260495
Synonyms:4-(2-(3-(3-(4-Bromobenzyl)-1,2,4-oxadiazol-5-yl)-1H-indol-1-yl)ethyl)morpholine | CHEMBL494376
TypeSmall organic molecule
Emp. Form.C23H23BrN4O2
Mol. Mass.467.358
SMILESBrc1ccc(Cc2noc(n2)-c2cn(CCN3CCOCC3)c3ccccc23)cc1