Reaction Details
TargetCannabinoid receptor 1
LigandBDBM50251195
Substrate/Competitorn/a
Meas. Tech.ChEMBL_531309 (CHEMBL989721)
IC50 1520±n/a nM
Citation Moloney, GPAngus, JARobertson, ADStoermer, MJRobinson, MWright, CEMcRae, KChristopoulos, A Synthesis and cannabinoid activity of 1-substituted-indole-3-oxadiazole derivatives: novel agonists for the CB1 receptor. Eur J Med Chem43:513-39 (2008) 
 
Cannabinoid receptor 1
Name:Cannabinoid receptor 1
Type:G Protein-Coupled Receptor (GPCR)
Mol. Mass.:52856.55
Organism:Rattus norvegicus (rat)
Description:P20272
Residue:473
BDBM50251195
NameBDBM50251195
Synonyms:4-(2-(3-(3-Biphenyl-4-yl)-1,2,4-oxadiazol-5-yl)-1Hindol-1-yl)ethyl)morpholine | CHEMBL458364
TypeSmall organic molecule
Emp. Form.C28H26N4O2
Mol. Mass.450.5316
SMILESC(Cn1cc(-c2nc(no2)-c2ccc(cc2)-c2ccccc2)c2ccccc12)N1CCOCC1