Reaction Details
TargetCannabinoid receptor 1
LigandBDBM50260499
Substrate/Competitorn/a
Meas. Tech.ChEMBL_531309 (CHEMBL989721)
IC50 8800±n/a nM
Citation Moloney, GPAngus, JARobertson, ADStoermer, MJRobinson, MWright, CEMcRae, KChristopoulos, A Synthesis and cannabinoid activity of 1-substituted-indole-3-oxadiazole derivatives: novel agonists for the CB1 receptor. Eur J Med Chem43:513-39 (2008) 
 
Cannabinoid receptor 1
Name:Cannabinoid receptor 1
Type:G Protein-Coupled Receptor (GPCR)
Mol. Mass.:52856.55
Organism:Rattus norvegicus (rat)
Description:P20272
Residue:473
BDBM50260499
NameBDBM50260499
Synonyms:3-Benzyl-5-(1-pentyl-1H-indol-3-yl)-1,2,4-oxadiazole | CHEMBL494394
TypeSmall organic molecule
Emp. Form.C22H23N3O
Mol. Mass.345.4375
SMILESCCCCCn1cc(-c2nc(Cc3ccccc3)no2)c2ccccc12