Reaction Details
TargetMatrix metalloproteinase-14
LigandBDBM50062351
Substrate/Competitorn/a
Meas. Tech.ChEMBL_507877 (CHEMBL952574)
IC50 4.7±n/a nM
Citation Johnson, ARPavlovsky, AGOrtwine, DFPrior, FMan, CFBornemeier, DABanotai, CAMueller, WTMcConnell, PYan, CBaragi, VLesch, CRoark, WHWilson, MDatta, KGuzman, RHan, HKDyer, RD Discovery and characterization of a novel inhibitor of matrix metalloprotease-13 that reduces cartilage damage in vivo without joint fibroplasia side effects. J Biol Chem282:27781-91 (2007) 
 
Matrix metalloproteinase-14
Name:Matrix metalloproteinase-14
Type:Protein
Mol. Mass.:65900.19
Organism:Homo sapiens (Human)
Description:P50281
Residue:582
BDBM50062351
NameBDBM50062351
Synonyms:(R)-N*4*-Hydroxy-N*1*-[(S)-2-(1H-indol-3-yl)-1-methylcarbamoyl-ethyl]-2-isobutyl-succinamide (R)-N1-((S)-3-(1H-indol-3-yl)-1-(methylamino)-1-oxopropan-2-yl)-N4-hydroxy-2-isobutylsuccinamide CHEMBL19611 US9487462, ilomastat
TypeSmall organic molecule
Emp. Form.C20H28N4O4
Mol. Mass.388.4607
SMILESCNC(=O)[C@H](Cc1c[nH]c2ccccc12)NC(=O)[C@H](CC(C)C)CC(=O)NO