Reaction Details
TargetMatrix metalloproteinase-17
LigandBDBM50265079
Substrate/Competitorn/a
Meas. Tech.ChEMBL_507879 (CHEMBL952576)
IC50>30000±n/a nM
Citation Johnson, ARPavlovsky, AGOrtwine, DFPrior, FMan, CFBornemeier, DABanotai, CAMueller, WTMcConnell, PYan, CBaragi, VLesch, CRoark, WHWilson, MDatta, KGuzman, RHan, HKDyer, RD Discovery and characterization of a novel inhibitor of matrix metalloprotease-13 that reduces cartilage damage in vivo without joint fibroplasia side effects. J Biol Chem282:27781-91 (2007) 
 
Matrix metalloproteinase-17
Name:Matrix metalloproteinase-17
Type:PROTEIN
Mol. Mass.:66652.56
Organism:Homo sapiens (Human)
Description:ChEMBL_1433225
Residue:603
BDBM50265079
NameBDBM50265079
Synonyms:(4-[1-methyl-2,4-dioxo-6-(3-phenyl-prop-1-ynyl)-1,4-dihydro-2H-quinazolin-3-ylmethyl]-benzoic acid) 4-{[1-METHYL-2,4-DIOXO-6-(3-PHENYLPROP-1-YN-1-YL)-1,4-DIHYDROQUINAZOLIN-3(2H)-YL]METHYL}BENZOIC ACID MMP Inhibitor, 5
TypeSmall organic molecule
Emp. Form.C26H20N2O4
Mol. Mass.424.448
SMILESCn1c2ccc(cc2c(=O)n(Cc2ccc(cc2)C(O)=O)c1=O)C#CCc1ccccc1