Reaction Details
TargetGamma-aminobutyric acid receptor subunit alpha-1
LigandBDBM26267
Substrate/Competitorn/a
Meas. Tech.ChEMBL_507909 (CHEMBL952530)
EC50 1.1±n/a nM
Citation Tan, KRGonthier, ABaur, RErnst, MGoeldner, MSigel, E Proximity-accelerated chemical coupling reaction in the benzodiazepine-binding site of gamma-aminobutyric acid type A receptors: superposition of different allosteric modulators. J Biol Chem282:26316-25 (2007) 
 
Gamma-aminobutyric acid receptor subunit alpha-1
Name:Gamma-aminobutyric acid receptor subunit alpha-1
Type:Protein
Mol. Mass.:51817.35
Organism:Homo sapiens (Human)
Description:P14867
Residue:456
BDBM26267
NameBDBM26267
Synonyms:RO-154513 [3H]Ro15-4513 | ethyl 12-azido-8-methyl-9-oxo-2,4,8-triazatricyclo[8.4.0.0^{2,6}]tetradeca-1(10),3,5,11,13-pentaene-5-carboxylate
Typeradiolabeled ligand
Emp. Form.C15H14N6O3
Mol. Mass.326.3101
SMILESCCOC(=O)c1ncn-2c1CN(C)C(=O)c1cc(ccc-21)N=[N+]=[N-]