Reaction Details
TargetBeta-lactamase
LigandBDBM50021959
Substrate/Competitorn/a
Meas. Tech.ChEMBL_542520 (CHEMBL1012503)
IC50>500000±n/a nM
Citation Papagiannitsis, CCTzouvelekis, LSTzelepi, EMiriagou, V Plasmid-encoded ACC-4, an extended-spectrum cephalosporinase variant from Escherichia coli. Antimicrob Agents Chemother51:3763-7 (2007) 
 
Beta-lactamase
Name:Beta-lactamase
Synonyms:Beta-lactamase ACC-4
Type:PROTEIN
Mol. Mass.:42018.74
Organism:Escherichia coli
Description:ChEMBL_542520
Residue:386
BDBM50021959
NameBDBM50021959
TypeSmall organic molecule
Emp. Form.C8H9NO5
Mol. Mass.199.1608
SMILESOC\C=C1/O[C@@H]2CC(=O)N2[C@H]1C(O)=O